{"text_format":"1","workbook":"xlsx","n_sheets":4,"sheets":["00 Pool","01 Instrument","02 Formular","03 Auswertung"],"not_rendered":{"charts":1,"images":1,"macros":1,"external_links":0,"defined_names":4,"comments":0,"pivot_tables":0},"unopened":[],"bounds":{"document_bytes":16777216,"sheet_cells":100000,"rows_first":2000,"rows_last":500,"rows_between":2000,"halvings":0,"cell_chars":16384,"cell_head_chars":4096},"cells_cut":0,"cells_raw":0,"read":"whole","date_system":"1900"}

{"sheet":"00 Pool","index":0,"n_rows":18,"n_cols":14,"rows_kept":18,"cut":false,"hidden":false,"merged":[]}
["Kompetenzorientierter Unterricht",null,null,null,null,null,null,null,null,"Qualitätskriterien"]
[]
["Pool"]
[]
[1,2,3,4,5,6,7,8,9,10,11,12]
["Authentische Anforderungssituationen","Erfolgserlebnisse","Transparente Leistungserwartungen","Feedback","Reflexion","Binnendifferenzierung und Individualisierung","Instruktion und Konstruktion","Kumulativer Kompetenzaufbau","Klassenführung","Klassenklima","Eigene Qualitätskriterien","(leer)",null,"Alle"]
["Die LP bindet Aufgaben/Fragen/Problemstellungen in den Unterricht ein, die für die Lernenden bedeutsam sind.","Die LP gestaltet den Unterricht so, dass die Lernenden Erfolgserlebnisse erfahren (z.B. durch Binnendifferenzierung, Feedback, transparente Leistungserwartungen).","Die LP setzt smarte Lehr- und/oder Lernziele (stimmig, messbar, attraktiv, realistisch, terminiert).","Die LP gibt den Lernenden ein individuelles Feedback zum Lernprozess und/oder Lernprodukt aufgrund von Beobachtungen und/oder formativen Beurteilungsformen.","Die LP setzt verschiedene Reflexionsformen korrekt ein (Lernen beschreiben, Lernen begründen, Erkenntnisse ableiten).","Die LP gibt den Lernenden individuelle und situative Unterstützung aufgrund gezielter Beobachtungen.","Die LP setzt Phasen von Instruktion und Konstruktion sinnvoll ein.","Die LP aktiviert Vorerfahrungen und Vorverständnisse der Lernenden (z.B. frühere Kompetenzen, frühere Themen).","Die LP sorgt für eine effiziente Nutzung der Lernzeit (z.B. Pünktlichkeit, vorbereitete Umgebung, reibungslose Übergänge).","Die LP behandelt die Lernenden respektvoll und wertschätzend.",{"$f":"IF('01 Instrument'!B47=\"\",\"(leer)\",'01 Instrument'!B47)","v":"(leer)"},"(leer)",null,{"$f":"A6","v":"Authentische Anforderungssituationen"}]
["Die LP schafft im Unterricht einen Bezug zur aktuellen Lebenswelt der Lernenden.","Die LP macht Lernerfolge für die Lernenden sichtbar.","Die LP gibt den Lernenden die Lernziele rechtzeitig, schriftlich und verständlich bekannt.","Die LP gibt den Lernenden korrektes Feedback (ziel- oder kriterienorientiert, wertschätzend, zukunftsgerichtet).","Die LP sorgt dafür, dass die Erkenntnisse der Reflexion für das Lernen genutzt werden.","Die LP ermöglicht den Lernenden verschiedene Lernzugänge (z.B. Tempo, Interesse, Hilfsmittel, Niveau) aufgrund ihrer Voraussetzungen.","Die LP sorgt dafür, dass sich Instruktion und Konstruktion aufeinander beziehen.","Die LP sorgt dafür, dass die Lernenden ihre Kompetenzen kumulativ erwerben (1. Erinnern, 2. Verstehen, 3. Anwenden, 4. Analysieren, 5. Evaluieren, 6. Erschaffen).","Die LP sorgt für einen ablenkungs- und störungsfreien Unterricht und interveniert lösungsorientiert.","Die LP bevorzugt/benachteiligt keine Lernenden.",{"$f":"IF('01 Instrument'!B48=\"\",\"(leer)\",'01 Instrument'!B48)","v":"(leer)"},"(leer)",null,{"$f":"B6","v":"Erfolgserlebnisse"}]
["Die LP kann die Lernenden für die Aufgaben/Fragen/Problemstellungen motivieren.","Die LP würdigt Lernerfolge der Lernenden.","Die LP stützt die Lernziele auf den Lehrplan ab.","Die LP gestaltet den Unterricht so, dass sich die Lernenden gegenseitig Feedback geben können.","Die LP dokumentiert die Reflexion der Lernenden in geeigneter Form.","Die LP ermöglicht den Lernenden verschiedene Lernzugänge durch gezielten Methoden- / Sozialformeneinsatz.","Die LP sorgt für mehrfache und gezielte Übungsphasen (komplexere Aufgaben erfordern längere Abstände zwischen den Übungsphasen).","(leer)","Die LP drückt sich klar und verständlich aus.","Die LP spricht Konflikte innerhalb der Klasse an und interveniert angemessen.",{"$f":"IF('01 Instrument'!B49=\"\",\"(leer)\",'01 Instrument'!B49)","v":"(leer)"},"(leer)",null,{"$f":"C6","v":"Transparente Leistungserwartungen"}]
["(leer)","(leer)","(leer)","Die LP stellt sicher, dass die Lernziele überprüft sind (z.B. durch Feedback, Selbstkorrektur, Fremdkorrektur).","(leer)","Die LP gestaltet den Unterricht so, dass die Lernenden weder unter- noch überfordert sind.","(leer)","(leer)","Die LP setzt Rituale gezielt ein und setzt Regelungen angemessen durch.","Die LP sorgt für eine positive Fehlerkultur und gegenseitige Unterstützung (LP-SuS; SuS-SuS).",{"$f":"IF('01 Instrument'!B50=\"\",\"(leer)\",'01 Instrument'!B50)","v":"(leer)"},"(leer)",null,{"$f":"D6","v":"Feedback"}]
["(leer)","(leer)","(leer)","Die LP holt von den Lernenden Feedback über das Lernen ein und nutzt dieses für die Weiterentwicklung des Unterrichts.","(leer)","Die LP veranschaulicht und vertieft Lösungen und Lösungswege der Lernenden.","(leer)","(leer)","(leer)","(leer)",{"$f":"IF('01 Instrument'!B51=\"\",\"(leer)\",'01 Instrument'!B51)","v":"(leer)"},"(leer)",null,{"$f":"E6","v":"Reflexion"}]
["(leer)","(leer)","(leer)","Die LP holt von den Lernenden Feedback über das Lehren ein und nutzt dieses für die Weiterentwicklung des Unterrichts.","(leer)","Die LP übergibt den Lernenden aufgrund ihrer Voraussetzungen Eigenverantwortung für ihre Lernziele, Lernprozesse und Lernprodukte.","(leer)","(leer)","(leer)","(leer)",{"$f":"IF('01 Instrument'!B52=\"\",\"(leer)\",'01 Instrument'!B52)","v":"(leer)"},"(leer)",null,{"$f":"F6","v":"Binnendifferenzierung und Individualisierung"}]
["(leer)","(leer)","(leer)","Die LP setzt verschiedene formative Beurteilungsformen gezielt ein.","(leer)","(leer)","(leer)","(leer)","(leer)","(leer)",{"$f":"IF('01 Instrument'!B53=\"\",\"(leer)\",'01 Instrument'!B53)","v":"(leer)"},"(leer)",null,{"$f":"G6","v":"Instruktion und Konstruktion"}]
["(leer)","(leer)","(leer)","Die LP gestaltet die formative Beurteilung lernzielorientiert.","(leer)","(leer)","(leer)","(leer)","(leer)","(leer)",{"$f":"IF('01 Instrument'!B54=\"\",\"(leer)\",'01 Instrument'!B54)","v":"(leer)"},"(leer)",null,{"$f":"H6","v":"Kumulativer Kompetenzaufbau"}]
["(leer)","(leer)","(leer)","(leer)","(leer)","(leer)","(leer)","(leer)","(leer)","(leer)",{"$f":"IF('01 Instrument'!B55=\"\",\"(leer)\",'01 Instrument'!B55)","v":"(leer)"},"(leer)",null,{"$f":"I6","v":"Klassenführung"}]
["(leer)","(leer)","(leer)","(leer)","(leer)","(leer)","(leer)","(leer)","(leer)","(leer)",{"$f":"IF('01 Instrument'!B56=\"\",\"(leer)\",'01 Instrument'!B56)","v":"(leer)"},"(leer)",null,{"$f":"J6","v":"Klassenklima"}]
[null,null,null,null,null,null,null,null,null,null,null,null,null,{"$f":"K6","v":"Eigene Qualitätskriterien"}]
[null,null,null,null,null,null,null,null,null,null,null,null,null,{"$f":"L6","v":"(leer)"}]

{"sheet":"01 Instrument","index":1,"n_rows":46,"n_cols":2,"rows_kept":46,"cut":false,"hidden":false,"merged":[]}
[]
["Bildungs- und Kulturdepartement"]
["Dienststelle Volksschulbildung"]
[]
["Instrument DVS Luzern"]
["Beurteilung Kompetenzorientierter Unterricht"]
[]
[]
[]
["A)","Formular generieren"]
[]
["1.","Wählen Sie für das Formular maximal 5 Qualitätsmerkmale."]
[null,"Authentische Anforderungssituationen"]
[null,"Erfolgserlebnisse"]
[null,"Transparente Leistungserwartungen"]
[null,"(leer)"]
[null,"(leer)"]
[]
["2.  ","Wählen Sie zwischen \"Unterrichtsbeurteilung Schulleitung\" und \"Selbsteinschätzung Lehrperson\"."]
[null,"Unterrichtsbeurteilung Schulleitung"]
[]
["3.","Klicken Sie auf den Button \"Generieren\", um das Formular zu generieren. "]
[]
[]
[]
[]
[]
[]
["B)","Auswertung generieren"]
[]
["1.","Wählen Sie für die Auswertung maximal 1 Qualitätsmerkmal."]
[null,"Authentische Anforderungssituationen"]
[]
["2.","Wählen Sie zwischen \"Unterrichtsbeurteilung Schulleitung\" und \"Selbsteinschätzung Lehrperson\"."]
[null,"Unterrichtsbeurteilung Schulleitung"]
[]
["3.","Klicken Sie auf den Button \"Generieren\", um die Auswertung zu generieren. "]
[]
[]
[]
[]
[]
[]
["C)","Optional: Eigene Qualitätskriterien bestimmen"]
[]
["1. ","Optional: Bestimmen Sie maximal 10 eigene Qualitätskriterien."]

{"sheet":"02 Formular","index":2,"n_rows":97,"n_cols":9,"rows_kept":97,"cut":false,"hidden":false,"merged":[[3,0,3,1],[58,0,58,1],[59,0,59,1],[60,0,60,1],[61,0,61,1],[47,0,47,1],[48,0,48,1],[49,0,49,1],[50,0,50,1],[51,0,51,1],[42,0,42,1],[43,0,43,1],[44,0,44,1],[45,0,45,1],[46,0,46,1],[36,0,36,1],[62,0,62,1],[53,0,53,1],[54,0,54,1],[55,0,55,1],[56,0,56,1],[57,0,57,1],[37,0,37,1],[38,0,38,1],[39,0,39,1],[40,0,40,1],[52,0,52,1],[20,0,20,1],[21,0,21,1],[22,0,22,1],[23,0,23,1],[24,0,24,1],[25,0,25,1],[26,0,26,1],[27,0,27,1],[28,0,28,1],[29,0,29,1],[31,0,31,1],[32,0,32,1],[33,0,33,1],[34,0,34,1],[35,0,35,1],[62,7,62,8],[8,0,8,1],[9,0,9,1],[10,0,10,1],[11,0,11,1],[12,0,12,1],[13,0,13,1],[14,0,14,1],[15,0,15,1],[16,0,16,1],[17,0,17,1],[18,0,18,1],[19,0,19,1],[30,0,30,1],[41,0,41,1],[57,7,57,8],[58,7,58,8],[59,7,59,8],[60,7,60,8],[61,7,61,8],[52,7,52,8],[53,7,53,8],[54,7,54,8],[55,7,55,8],[56,7,56,8],[41,7,41,8],[42,7,42,8],[43,7,43,8],[44,7,44,8],[45,7,45,8],[32,7,32,8],[33,7,33,8],[34,7,34,8],[35,7,35,8],[36,7,36,8],[20,7,20,8],[21,7,21,8],[22,7,22,8],[30,7,30,8],[31,7,31,8],[3,2,3,6],[8,7,8,8],[9,7,9,8],[10,7,10,8],[19,7,19,8]]}
[]
["Kompetenzorientierter Unterricht",null,null,null,null,null,null,null,"Qualitätskriterien"]
[]
[{"$f":"'01 Instrument'!B20","v":"Unterrichtsbeurteilung Schulleitung"},null,{"$f":"IF(A4=\"Unterrichtsbeurteilung Schulleitung\",\"SL\",IF(A4=\"Selbsteinschätzung Lehrperson\",\"LP\",0))","v":"SL"},null,null,null,null,null,"© DVS Luzern"]
[]
["Name",null,null,null,null,null,null,"Datum/Zeit"]
["Funktion",null,null,null,null,null,null,"Klasse/Fach"]
[]
[{"$f":"'01 Instrument'!B13","v":"Authentische Anforderungssituationen"},null,"--","-","a","+","++","Woran erkenne ich das?"]
[{"$f":"IF($A$9='00 Pool'!$A$6,'00 Pool'!A7,IF($A$9='00 Pool'!$B$6,'00 Pool'!B7,IF($A$9='00 Pool'!$C$6,'00 Pool'!C7,IF($A$9='00 Pool'!$D$6,'00 Pool'!D7,IF($A$9='00 Pool'!$E$6,'00 Pool'!E7,IF($A$9='00 Pool'!$F$6,'00 Pool'!F7,IF($A$9='00 Pool'!$G$6,'00 Pool'!G7,IF($A$9='00 Pool'!$H$6,'00 Pool'!H7,IF($A$9='00 Pool'!$I$6,'00 Pool'!I7,IF($A$9='00 Pool'!$J$6,'00 Pool'!J7,IF($A$9='00 Pool'!$K$6,'00 Pool'!K7,IF($A$9='00 Pool'!$L$6,'00 Pool'!L7,0))))))))))))","v":"Die LP bindet Aufgaben/Fragen/Problemstellungen in den Unterricht ein, die für die Lernenden bedeutsam sind."}]
[{"$f":"IF($A$9='00 Pool'!$A$6,'00 Pool'!A8,IF($A$9='00 Pool'!$B$6,'00 Pool'!B8,IF($A$9='00 Pool'!$C$6,'00 Pool'!C8,IF($A$9='00 Pool'!$D$6,'00 Pool'!D8,IF($A$9='00 Pool'!$E$6,'00 Pool'!E8,IF($A$9='00 Pool'!$F$6,'00 Pool'!F8,IF($A$9='00 Pool'!$G$6,'00 Pool'!G8,IF($A$9='00 Pool'!$H$6,'00 Pool'!H8,IF($A$9='00 Pool'!$I$6,'00 Pool'!I8,IF($A$9='00 Pool'!$J$6,'00 Pool'!J8,IF($A$9='00 Pool'!$K$6,'00 Pool'!K8,IF($A$9='00 Pool'!$L$6,'00 Pool'!L8,0))))))))))))","v":"Die LP schafft im Unterricht einen Bezug zur aktuellen Lebenswelt der Lernenden."}]
[{"$f":"IF($A$9='00 Pool'!$A$6,'00 Pool'!A9,IF($A$9='00 Pool'!$B$6,'00 Pool'!B9,IF($A$9='00 Pool'!$C$6,'00 Pool'!C9,IF($A$9='00 Pool'!$D$6,'00 Pool'!D9,IF($A$9='00 Pool'!$E$6,'00 Pool'!E9,IF($A$9='00 Pool'!$F$6,'00 Pool'!F9,IF($A$9='00 Pool'!$G$6,'00 Pool'!G9,IF($A$9='00 Pool'!$H$6,'00 Pool'!H9,IF($A$9='00 Pool'!$I$6,'00 Pool'!I9,IF($A$9='00 Pool'!$J$6,'00 Pool'!J9,IF($A$9='00 Pool'!$K$6,'00 Pool'!K9,IF($A$9='00 Pool'!$L$6,'00 Pool'!L9,0))))))))))))","v":"Die LP kann die Lernenden für die Aufgaben/Fragen/Problemstellungen motivieren."}]
[{"$f":"IF($A$9='00 Pool'!$A$6,'00 Pool'!A10,IF($A$9='00 Pool'!$B$6,'00 Pool'!B10,IF($A$9='00 Pool'!$C$6,'00 Pool'!C10,IF($A$9='00 Pool'!$D$6,'00 Pool'!D10,IF($A$9='00 Pool'!$E$6,'00 Pool'!E10,IF($A$9='00 Pool'!$F$6,'00 Pool'!F10,IF($A$9='00 Pool'!$G$6,'00 Pool'!G10,IF($A$9='00 Pool'!$H$6,'00 Pool'!H10,IF($A$9='00 Pool'!$I$6,'00 Pool'!I10,IF($A$9='00 Pool'!$J$6,'00 Pool'!J10,IF($A$9='00 Pool'!$K$6,'00 Pool'!K10,IF($A$9='00 Pool'!$L$6,'00 Pool'!L10,0))))))))))))","v":"(leer)"}]
[{"$f":"IF($A$9='00 Pool'!$A$6,'00 Pool'!A11,IF($A$9='00 Pool'!$B$6,'00 Pool'!B11,IF($A$9='00 Pool'!$C$6,'00 Pool'!C11,IF($A$9='00 Pool'!$D$6,'00 Pool'!D11,IF($A$9='00 Pool'!$E$6,'00 Pool'!E11,IF($A$9='00 Pool'!$F$6,'00 Pool'!F11,IF($A$9='00 Pool'!$G$6,'00 Pool'!G11,IF($A$9='00 Pool'!$H$6,'00 Pool'!H11,IF($A$9='00 Pool'!$I$6,'00 Pool'!I11,IF($A$9='00 Pool'!$J$6,'00 Pool'!J11,IF($A$9='00 Pool'!$K$6,'00 Pool'!K11,IF($A$9='00 Pool'!$L$6,'00 Pool'!L11,0))))))))))))","v":"(leer)"}]
[{"$f":"IF($A$9='00 Pool'!$A$6,'00 Pool'!A12,IF($A$9='00 Pool'!$B$6,'00 Pool'!B12,IF($A$9='00 Pool'!$C$6,'00 Pool'!C12,IF($A$9='00 Pool'!$D$6,'00 Pool'!D12,IF($A$9='00 Pool'!$E$6,'00 Pool'!E12,IF($A$9='00 Pool'!$F$6,'00 Pool'!F12,IF($A$9='00 Pool'!$G$6,'00 Pool'!G12,IF($A$9='00 Pool'!$H$6,'00 Pool'!H12,IF($A$9='00 Pool'!$I$6,'00 Pool'!I12,IF($A$9='00 Pool'!$J$6,'00 Pool'!J12,IF($A$9='00 Pool'!$K$6,'00 Pool'!K12,IF($A$9='00 Pool'!$L$6,'00 Pool'!L12,0))))))))))))","v":"(leer)"}]
[{"$f":"IF($A$9='00 Pool'!$A$6,'00 Pool'!A13,IF($A$9='00 Pool'!$B$6,'00 Pool'!B13,IF($A$9='00 Pool'!$C$6,'00 Pool'!C13,IF($A$9='00 Pool'!$D$6,'00 Pool'!D13,IF($A$9='00 Pool'!$E$6,'00 Pool'!E13,IF($A$9='00 Pool'!$F$6,'00 Pool'!F13,IF($A$9='00 Pool'!$G$6,'00 Pool'!G13,IF($A$9='00 Pool'!$H$6,'00 Pool'!H13,IF($A$9='00 Pool'!$I$6,'00 Pool'!I13,IF($A$9='00 Pool'!$J$6,'00 Pool'!J13,IF($A$9='00 Pool'!$K$6,'00 Pool'!K13,IF($A$9='00 Pool'!$L$6,'00 Pool'!L13,0))))))))))))","v":"(leer)"}]
[{"$f":"IF($A$9='00 Pool'!$A$6,'00 Pool'!A14,IF($A$9='00 Pool'!$B$6,'00 Pool'!B14,IF($A$9='00 Pool'!$C$6,'00 Pool'!C14,IF($A$9='00 Pool'!$D$6,'00 Pool'!D14,IF($A$9='00 Pool'!$E$6,'00 Pool'!E14,IF($A$9='00 Pool'!$F$6,'00 Pool'!F14,IF($A$9='00 Pool'!$G$6,'00 Pool'!G14,IF($A$9='00 Pool'!$H$6,'00 Pool'!H14,IF($A$9='00 Pool'!$I$6,'00 Pool'!I14,IF($A$9='00 Pool'!$J$6,'00 Pool'!J14,IF($A$9='00 Pool'!$K$6,'00 Pool'!K14,IF($A$9='00 Pool'!$L$6,'00 Pool'!L14,0))))))))))))","v":"(leer)"}]
[{"$f":"IF($A$9='00 Pool'!$A$6,'00 Pool'!A15,IF($A$9='00 Pool'!$B$6,'00 Pool'!B15,IF($A$9='00 Pool'!$C$6,'00 Pool'!C15,IF($A$9='00 Pool'!$D$6,'00 Pool'!D15,IF($A$9='00 Pool'!$E$6,'00 Pool'!E15,IF($A$9='00 Pool'!$F$6,'00 Pool'!F15,IF($A$9='00 Pool'!$G$6,'00 Pool'!G15,IF($A$9='00 Pool'!$H$6,'00 Pool'!H15,IF($A$9='00 Pool'!$I$6,'00 Pool'!I15,IF($A$9='00 Pool'!$J$6,'00 Pool'!J15,IF($A$9='00 Pool'!$K$6,'00 Pool'!K15,IF($A$9='00 Pool'!$L$6,'00 Pool'!L15,0))))))))))))","v":"(leer)"}]
[{"$f":"IF($A$9='00 Pool'!$A$6,'00 Pool'!A16,IF($A$9='00 Pool'!$B$6,'00 Pool'!B16,IF($A$9='00 Pool'!$C$6,'00 Pool'!C16,IF($A$9='00 Pool'!$D$6,'00 Pool'!D16,IF($A$9='00 Pool'!$E$6,'00 Pool'!E16,IF($A$9='00 Pool'!$F$6,'00 Pool'!F16,IF($A$9='00 Pool'!$G$6,'00 Pool'!G16,IF($A$9='00 Pool'!$H$6,'00 Pool'!H16,IF($A$9='00 Pool'!$I$6,'00 Pool'!I16,IF($A$9='00 Pool'!$J$6,'00 Pool'!J16,IF($A$9='00 Pool'!$K$6,'00 Pool'!K16,IF($A$9='00 Pool'!$L$6,'00 Pool'!L16,0))))))))))))","v":"(leer)"}]
[{"$f":"'01 Instrument'!B14","v":"Erfolgserlebnisse"},null,"--","-","a","+","++"]
[{"$f":"IF($A$20='00 Pool'!$A$6,'00 Pool'!A7,IF($A$20='00 Pool'!$B$6,'00 Pool'!B7,IF($A$20='00 Pool'!$C$6,'00 Pool'!C7,IF($A$20='00 Pool'!$D$6,'00 Pool'!D7,IF($A$20='00 Pool'!$E$6,'00 Pool'!E7,IF($A$20='00 Pool'!$F$6,'00 Pool'!F7,IF($A$20='00 Pool'!$G$6,'00 Pool'!G7,IF($A$20='00 Pool'!$H$6,'00 Pool'!H7,IF($A$20='00 Pool'!$I$6,'00 Pool'!I7,IF($A$20='00 Pool'!$J$6,'00 Pool'!J7,IF($A$20='00 Pool'!$K$6,'00 Pool'!K7,IF($A$20='00 Pool'!$L$6,'00 Pool'!L7,0))))))))))))","v":"Die LP gestaltet den Unterricht so, dass die Lernenden Erfolgserlebnisse erfahren (z.B. durch Binnendifferenzierung, Feedback, transparente Leistungserwartungen)."}]
[{"$f":"IF($A$20='00 Pool'!$A$6,'00 Pool'!A8,IF($A$20='00 Pool'!$B$6,'00 Pool'!B8,IF($A$20='00 Pool'!$C$6,'00 Pool'!C8,IF($A$20='00 Pool'!$D$6,'00 Pool'!D8,IF($A$20='00 Pool'!$E$6,'00 Pool'!E8,IF($A$20='00 Pool'!$F$6,'00 Pool'!F8,IF($A$20='00 Pool'!$G$6,'00 Pool'!G8,IF($A$20='00 Pool'!$H$6,'00 Pool'!H8,IF($A$20='00 Pool'!$I$6,'00 Pool'!I8,IF($A$20='00 Pool'!$J$6,'00 Pool'!J8,IF($A$20='00 Pool'!$K$6,'00 Pool'!K8,IF($A$20='00 Pool'!$L$6,'00 Pool'!L8,0))))))))))))","v":"Die LP macht Lernerfolge für die Lernenden sichtbar."}]
[{"$f":"IF($A$20='00 Pool'!$A$6,'00 Pool'!A9,IF($A$20='00 Pool'!$B$6,'00 Pool'!B9,IF($A$20='00 Pool'!$C$6,'00 Pool'!C9,IF($A$20='00 Pool'!$D$6,'00 Pool'!D9,IF($A$20='00 Pool'!$E$6,'00 Pool'!E9,IF($A$20='00 Pool'!$F$6,'00 Pool'!F9,IF($A$20='00 Pool'!$G$6,'00 Pool'!G9,IF($A$20='00 Pool'!$H$6,'00 Pool'!H9,IF($A$20='00 Pool'!$I$6,'00 Pool'!I9,IF($A$20='00 Pool'!$J$6,'00 Pool'!J9,IF($A$20='00 Pool'!$K$6,'00 Pool'!K9,IF($A$20='00 Pool'!$L$6,'00 Pool'!L9,0))))))))))))","v":"Die LP würdigt Lernerfolge der Lernenden."}]
[{"$f":"IF($A$20='00 Pool'!$A$6,'00 Pool'!A10,IF($A$20='00 Pool'!$B$6,'00 Pool'!B10,IF($A$20='00 Pool'!$C$6,'00 Pool'!C10,IF($A$20='00 Pool'!$D$6,'00 Pool'!D10,IF($A$20='00 Pool'!$E$6,'00 Pool'!E10,IF($A$20='00 Pool'!$F$6,'00 Pool'!F10,IF($A$20='00 Pool'!$G$6,'00 Pool'!G10,IF($A$20='00 Pool'!$H$6,'00 Pool'!H10,IF($A$20='00 Pool'!$I$6,'00 Pool'!I10,IF($A$20='00 Pool'!$J$6,'00 Pool'!J10,IF($A$20='00 Pool'!$K$6,'00 Pool'!K10,IF($A$20='00 Pool'!$L$6,'00 Pool'!L10,0))))))))))))","v":"(leer)"}]
[{"$f":"IF($A$20='00 Pool'!$A$6,'00 Pool'!A11,IF($A$20='00 Pool'!$B$6,'00 Pool'!B11,IF($A$20='00 Pool'!$C$6,'00 Pool'!C11,IF($A$20='00 Pool'!$D$6,'00 Pool'!D11,IF($A$20='00 Pool'!$E$6,'00 Pool'!E11,IF($A$20='00 Pool'!$F$6,'00 Pool'!F11,IF($A$20='00 Pool'!$G$6,'00 Pool'!G11,IF($A$20='00 Pool'!$H$6,'00 Pool'!H11,IF($A$20='00 Pool'!$I$6,'00 Pool'!I11,IF($A$20='00 Pool'!$J$6,'00 Pool'!J11,IF($A$20='00 Pool'!$K$6,'00 Pool'!K11,IF($A$20='00 Pool'!$L$6,'00 Pool'!L11,0))))))))))))","v":"(leer)"}]
[{"$f":"IF($A$20='00 Pool'!$A$6,'00 Pool'!A12,IF($A$20='00 Pool'!$B$6,'00 Pool'!B12,IF($A$20='00 Pool'!$C$6,'00 Pool'!C12,IF($A$20='00 Pool'!$D$6,'00 Pool'!D12,IF($A$20='00 Pool'!$E$6,'00 Pool'!E12,IF($A$20='00 Pool'!$F$6,'00 Pool'!F12,IF($A$20='00 Pool'!$G$6,'00 Pool'!G12,IF($A$20='00 Pool'!$H$6,'00 Pool'!H12,IF($A$20='00 Pool'!$I$6,'00 Pool'!I12,IF($A$20='00 Pool'!$J$6,'00 Pool'!J12,IF($A$20='00 Pool'!$K$6,'00 Pool'!K12,IF($A$20='00 Pool'!$L$6,'00 Pool'!L12,0))))))))))))","v":"(leer)"}]
[{"$f":"IF($A$20='00 Pool'!$A$6,'00 Pool'!A13,IF($A$20='00 Pool'!$B$6,'00 Pool'!B13,IF($A$20='00 Pool'!$C$6,'00 Pool'!C13,IF($A$20='00 Pool'!$D$6,'00 Pool'!D13,IF($A$20='00 Pool'!$E$6,'00 Pool'!E13,IF($A$20='00 Pool'!$F$6,'00 Pool'!F13,IF($A$20='00 Pool'!$G$6,'00 Pool'!G13,IF($A$20='00 Pool'!$H$6,'00 Pool'!H13,IF($A$20='00 Pool'!$I$6,'00 Pool'!I13,IF($A$20='00 Pool'!$J$6,'00 Pool'!J13,IF($A$20='00 Pool'!$K$6,'00 Pool'!K13,IF($A$20='00 Pool'!$L$6,'00 Pool'!L13,0))))))))))))","v":"(leer)"}]
[{"$f":"IF($A$20='00 Pool'!$A$6,'00 Pool'!A14,IF($A$20='00 Pool'!$B$6,'00 Pool'!B14,IF($A$20='00 Pool'!$C$6,'00 Pool'!C14,IF($A$20='00 Pool'!$D$6,'00 Pool'!D14,IF($A$20='00 Pool'!$E$6,'00 Pool'!E14,IF($A$20='00 Pool'!$F$6,'00 Pool'!F14,IF($A$20='00 Pool'!$G$6,'00 Pool'!G14,IF($A$20='00 Pool'!$H$6,'00 Pool'!H14,IF($A$20='00 Pool'!$I$6,'00 Pool'!I14,IF($A$20='00 Pool'!$J$6,'00 Pool'!J14,IF($A$20='00 Pool'!$K$6,'00 Pool'!K14,IF($A$20='00 Pool'!$L$6,'00 Pool'!L14,0))))))))))))","v":"(leer)"}]
[{"$f":"IF($A$20='00 Pool'!$A$6,'00 Pool'!A15,IF($A$20='00 Pool'!$B$6,'00 Pool'!B15,IF($A$20='00 Pool'!$C$6,'00 Pool'!C15,IF($A$20='00 Pool'!$D$6,'00 Pool'!D15,IF($A$20='00 Pool'!$E$6,'00 Pool'!E15,IF($A$20='00 Pool'!$F$6,'00 Pool'!F15,IF($A$20='00 Pool'!$G$6,'00 Pool'!G15,IF($A$20='00 Pool'!$H$6,'00 Pool'!H15,IF($A$20='00 Pool'!$I$6,'00 Pool'!I15,IF($A$20='00 Pool'!$J$6,'00 Pool'!J15,IF($A$20='00 Pool'!$K$6,'00 Pool'!K15,IF($A$20='00 Pool'!$L$6,'00 Pool'!L15,0))))))))))))","v":"(leer)"}]
[{"$f":"IF($A$20='00 Pool'!$A$6,'00 Pool'!A16,IF($A$20='00 Pool'!$B$6,'00 Pool'!B16,IF($A$20='00 Pool'!$C$6,'00 Pool'!C16,IF($A$20='00 Pool'!$D$6,'00 Pool'!D16,IF($A$20='00 Pool'!$E$6,'00 Pool'!E16,IF($A$20='00 Pool'!$F$6,'00 Pool'!F16,IF($A$20='00 Pool'!$G$6,'00 Pool'!G16,IF($A$20='00 Pool'!$H$6,'00 Pool'!H16,IF($A$20='00 Pool'!$I$6,'00 Pool'!I16,IF($A$20='00 Pool'!$J$6,'00 Pool'!J16,IF($A$20='00 Pool'!$K$6,'00 Pool'!K16,IF($A$20='00 Pool'!$L$6,'00 Pool'!L16,0))))))))))))","v":"(leer)"}]
[{"$f":"'01 Instrument'!B15","v":"Transparente Leistungserwartungen"},null,"--","-","a","+","++"]
[{"$f":"IF($A$31='00 Pool'!$A$6,'00 Pool'!A7,IF($A$31='00 Pool'!$B$6,'00 Pool'!B7,IF($A$31='00 Pool'!$C$6,'00 Pool'!C7,IF($A$31='00 Pool'!$D$6,'00 Pool'!D7,IF($A$31='00 Pool'!$E$6,'00 Pool'!E7,IF($A$31='00 Pool'!$F$6,'00 Pool'!F7,IF($A$31='00 Pool'!$G$6,'00 Pool'!G7,IF($A$31='00 Pool'!$H$6,'00 Pool'!H7,IF($A$31='00 Pool'!$I$6,'00 Pool'!I7,IF($A$31='00 Pool'!$J$6,'00 Pool'!J7,IF($A$31='00 Pool'!$K$6,'00 Pool'!K7,IF($A$31='00 Pool'!$L$6,'00 Pool'!L7,0))))))))))))","v":"Die LP setzt smarte Lehr- und/oder Lernziele (stimmig, messbar, attraktiv, realistisch, terminiert)."}]
[{"$f":"IF($A$31='00 Pool'!$A$6,'00 Pool'!A8,IF($A$31='00 Pool'!$B$6,'00 Pool'!B8,IF($A$31='00 Pool'!$C$6,'00 Pool'!C8,IF($A$31='00 Pool'!$D$6,'00 Pool'!D8,IF($A$31='00 Pool'!$E$6,'00 Pool'!E8,IF($A$31='00 Pool'!$F$6,'00 Pool'!F8,IF($A$31='00 Pool'!$G$6,'00 Pool'!G8,IF($A$31='00 Pool'!$H$6,'00 Pool'!H8,IF($A$31='00 Pool'!$I$6,'00 Pool'!I8,IF($A$31='00 Pool'!$J$6,'00 Pool'!J8,IF($A$31='00 Pool'!$K$6,'00 Pool'!K8,IF($A$31='00 Pool'!$L$6,'00 Pool'!L8,0))))))))))))","v":"Die LP gibt den Lernenden die Lernziele rechtzeitig, schriftlich und verständlich bekannt."}]
[{"$f":"IF($A$31='00 Pool'!$A$6,'00 Pool'!A9,IF($A$31='00 Pool'!$B$6,'00 Pool'!B9,IF($A$31='00 Pool'!$C$6,'00 Pool'!C9,IF($A$31='00 Pool'!$D$6,'00 Pool'!D9,IF($A$31='00 Pool'!$E$6,'00 Pool'!E9,IF($A$31='00 Pool'!$F$6,'00 Pool'!F9,IF($A$31='00 Pool'!$G$6,'00 Pool'!G9,IF($A$31='00 Pool'!$H$6,'00 Pool'!H9,IF($A$31='00 Pool'!$I$6,'00 Pool'!I9,IF($A$31='00 Pool'!$J$6,'00 Pool'!J9,IF($A$31='00 Pool'!$K$6,'00 Pool'!K9,IF($A$31='00 Pool'!$L$6,'00 Pool'!L9,0))))))))))))","v":"Die LP stützt die Lernziele auf den Lehrplan ab."}]
[{"$f":"IF($A$31='00 Pool'!$A$6,'00 Pool'!A10,IF($A$31='00 Pool'!$B$6,'00 Pool'!B10,IF($A$31='00 Pool'!$C$6,'00 Pool'!C10,IF($A$31='00 Pool'!$D$6,'00 Pool'!D10,IF($A$31='00 Pool'!$E$6,'00 Pool'!E10,IF($A$31='00 Pool'!$F$6,'00 Pool'!F10,IF($A$31='00 Pool'!$G$6,'00 Pool'!G10,IF($A$31='00 Pool'!$H$6,'00 Pool'!H10,IF($A$31='00 Pool'!$I$6,'00 Pool'!I10,IF($A$31='00 Pool'!$J$6,'00 Pool'!J10,IF($A$31='00 Pool'!$K$6,'00 Pool'!K10,IF($A$31='00 Pool'!$L$6,'00 Pool'!L10,0))))))))))))","v":"(leer)"}]
[{"$f":"IF($A$31='00 Pool'!$A$6,'00 Pool'!A11,IF($A$31='00 Pool'!$B$6,'00 Pool'!B11,IF($A$31='00 Pool'!$C$6,'00 Pool'!C11,IF($A$31='00 Pool'!$D$6,'00 Pool'!D11,IF($A$31='00 Pool'!$E$6,'00 Pool'!E11,IF($A$31='00 Pool'!$F$6,'00 Pool'!F11,IF($A$31='00 Pool'!$G$6,'00 Pool'!G11,IF($A$31='00 Pool'!$H$6,'00 Pool'!H11,IF($A$31='00 Pool'!$I$6,'00 Pool'!I11,IF($A$31='00 Pool'!$J$6,'00 Pool'!J11,IF($A$31='00 Pool'!$K$6,'00 Pool'!K11,IF($A$31='00 Pool'!$L$6,'00 Pool'!L11,0))))))))))))","v":"(leer)"}]
[{"$f":"IF($A$31='00 Pool'!$A$6,'00 Pool'!A12,IF($A$31='00 Pool'!$B$6,'00 Pool'!B12,IF($A$31='00 Pool'!$C$6,'00 Pool'!C12,IF($A$31='00 Pool'!$D$6,'00 Pool'!D12,IF($A$31='00 Pool'!$E$6,'00 Pool'!E12,IF($A$31='00 Pool'!$F$6,'00 Pool'!F12,IF($A$31='00 Pool'!$G$6,'00 Pool'!G12,IF($A$31='00 Pool'!$H$6,'00 Pool'!H12,IF($A$31='00 Pool'!$I$6,'00 Pool'!I12,IF($A$31='00 Pool'!$J$6,'00 Pool'!J12,IF($A$31='00 Pool'!$K$6,'00 Pool'!K12,IF($A$31='00 Pool'!$L$6,'00 Pool'!L12,0))))))))))))","v":"(leer)"}]
[{"$f":"IF($A$31='00 Pool'!$A$6,'00 Pool'!A13,IF($A$31='00 Pool'!$B$6,'00 Pool'!B13,IF($A$31='00 Pool'!$C$6,'00 Pool'!C13,IF($A$31='00 Pool'!$D$6,'00 Pool'!D13,IF($A$31='00 Pool'!$E$6,'00 Pool'!E13,IF($A$31='00 Pool'!$F$6,'00 Pool'!F13,IF($A$31='00 Pool'!$G$6,'00 Pool'!G13,IF($A$31='00 Pool'!$H$6,'00 Pool'!H13,IF($A$31='00 Pool'!$I$6,'00 Pool'!I13,IF($A$31='00 Pool'!$J$6,'00 Pool'!J13,IF($A$31='00 Pool'!$K$6,'00 Pool'!K13,IF($A$31='00 Pool'!$L$6,'00 Pool'!L13,0))))))))))))","v":"(leer)"}]
[{"$f":"IF($A$31='00 Pool'!$A$6,'00 Pool'!A14,IF($A$31='00 Pool'!$B$6,'00 Pool'!B14,IF($A$31='00 Pool'!$C$6,'00 Pool'!C14,IF($A$31='00 Pool'!$D$6,'00 Pool'!D14,IF($A$31='00 Pool'!$E$6,'00 Pool'!E14,IF($A$31='00 Pool'!$F$6,'00 Pool'!F14,IF($A$31='00 Pool'!$G$6,'00 Pool'!G14,IF($A$31='00 Pool'!$H$6,'00 Pool'!H14,IF($A$31='00 Pool'!$I$6,'00 Pool'!I14,IF($A$31='00 Pool'!$J$6,'00 Pool'!J14,IF($A$31='00 Pool'!$K$6,'00 Pool'!K14,IF($A$31='00 Pool'!$L$6,'00 Pool'!L14,0))))))))))))","v":"(leer)"}]
[{"$f":"IF($A$31='00 Pool'!$A$6,'00 Pool'!A15,IF($A$31='00 Pool'!$B$6,'00 Pool'!B15,IF($A$31='00 Pool'!$C$6,'00 Pool'!C15,IF($A$31='00 Pool'!$D$6,'00 Pool'!D15,IF($A$31='00 Pool'!$E$6,'00 Pool'!E15,IF($A$31='00 Pool'!$F$6,'00 Pool'!F15,IF($A$31='00 Pool'!$G$6,'00 Pool'!G15,IF($A$31='00 Pool'!$H$6,'00 Pool'!H15,IF($A$31='00 Pool'!$I$6,'00 Pool'!I15,IF($A$31='00 Pool'!$J$6,'00 Pool'!J15,IF($A$31='00 Pool'!$K$6,'00 Pool'!K15,IF($A$31='00 Pool'!$L$6,'00 Pool'!L15,0))))))))))))","v":"(leer)"}]
[{"$f":"IF($A$31='00 Pool'!$A$6,'00 Pool'!A16,IF($A$31='00 Pool'!$B$6,'00 Pool'!B16,IF($A$31='00 Pool'!$C$6,'00 Pool'!C16,IF($A$31='00 Pool'!$D$6,'00 Pool'!D16,IF($A$31='00 Pool'!$E$6,'00 Pool'!E16,IF($A$31='00 Pool'!$F$6,'00 Pool'!F16,IF($A$31='00 Pool'!$G$6,'00 Pool'!G16,IF($A$31='00 Pool'!$H$6,'00 Pool'!H16,IF($A$31='00 Pool'!$I$6,'00 Pool'!I16,IF($A$31='00 Pool'!$J$6,'00 Pool'!J16,IF($A$31='00 Pool'!$K$6,'00 Pool'!K16,IF($A$31='00 Pool'!$L$6,'00 Pool'!L16,0))))))))))))","v":"(leer)"}]
[{"$f":"'01 Instrument'!B16","v":"(leer)"},null,"--","-","a","+","++"]
[{"$f":"IF($A$42='00 Pool'!$A$6,'00 Pool'!A7,IF($A$42='00 Pool'!$B$6,'00 Pool'!B7,IF($A$42='00 Pool'!$C$6,'00 Pool'!C7,IF($A$42='00 Pool'!$D$6,'00 Pool'!D7,IF($A$42='00 Pool'!$E$6,'00 Pool'!E7,IF($A$42='00 Pool'!$F$6,'00 Pool'!F7,IF($A$42='00 Pool'!$G$6,'00 Pool'!G7,IF($A$42='00 Pool'!$H$6,'00 Pool'!H7,IF($A$42='00 Pool'!$I$6,'00 Pool'!I7,IF($A$42='00 Pool'!$J$6,'00 Pool'!J7,IF($A$42='00 Pool'!$K$6,'00 Pool'!K7,IF($A$42='00 Pool'!$L$6,'00 Pool'!L7,0))))))))))))","v":"(leer)"}]
[{"$f":"IF($A$42='00 Pool'!$A$6,'00 Pool'!A8,IF($A$42='00 Pool'!$B$6,'00 Pool'!B8,IF($A$42='00 Pool'!$C$6,'00 Pool'!C8,IF($A$42='00 Pool'!$D$6,'00 Pool'!D8,IF($A$42='00 Pool'!$E$6,'00 Pool'!E8,IF($A$42='00 Pool'!$F$6,'00 Pool'!F8,IF($A$42='00 Pool'!$G$6,'00 Pool'!G8,IF($A$42='00 Pool'!$H$6,'00 Pool'!H8,IF($A$42='00 Pool'!$I$6,'00 Pool'!I8,IF($A$42='00 Pool'!$J$6,'00 Pool'!J8,IF($A$42='00 Pool'!$K$6,'00 Pool'!K8,IF($A$42='00 Pool'!$L$6,'00 Pool'!L8,0))))))))))))","v":"(leer)"}]
[{"$f":"IF($A$42='00 Pool'!$A$6,'00 Pool'!A9,IF($A$42='00 Pool'!$B$6,'00 Pool'!B9,IF($A$42='00 Pool'!$C$6,'00 Pool'!C9,IF($A$42='00 Pool'!$D$6,'00 Pool'!D9,IF($A$42='00 Pool'!$E$6,'00 Pool'!E9,IF($A$42='00 Pool'!$F$6,'00 Pool'!F9,IF($A$42='00 Pool'!$G$6,'00 Pool'!G9,IF($A$42='00 Pool'!$H$6,'00 Pool'!H9,IF($A$42='00 Pool'!$I$6,'00 Pool'!I9,IF($A$42='00 Pool'!$J$6,'00 Pool'!J9,IF($A$42='00 Pool'!$K$6,'00 Pool'!K9,IF($A$42='00 Pool'!$L$6,'00 Pool'!L9,0))))))))))))","v":"(leer)"}]
[{"$f":"IF($A$42='00 Pool'!$A$6,'00 Pool'!A10,IF($A$42='00 Pool'!$B$6,'00 Pool'!B10,IF($A$42='00 Pool'!$C$6,'00 Pool'!C10,IF($A$42='00 Pool'!$D$6,'00 Pool'!D10,IF($A$42='00 Pool'!$E$6,'00 Pool'!E10,IF($A$42='00 Pool'!$F$6,'00 Pool'!F10,IF($A$42='00 Pool'!$G$6,'00 Pool'!G10,IF($A$42='00 Pool'!$H$6,'00 Pool'!H10,IF($A$42='00 Pool'!$I$6,'00 Pool'!I10,IF($A$42='00 Pool'!$J$6,'00 Pool'!J10,IF($A$42='00 Pool'!$K$6,'00 Pool'!K10,IF($A$42='00 Pool'!$L$6,'00 Pool'!L10,0))))))))))))","v":"(leer)"}]
[{"$f":"IF($A$42='00 Pool'!$A$6,'00 Pool'!A11,IF($A$42='00 Pool'!$B$6,'00 Pool'!B11,IF($A$42='00 Pool'!$C$6,'00 Pool'!C11,IF($A$42='00 Pool'!$D$6,'00 Pool'!D11,IF($A$42='00 Pool'!$E$6,'00 Pool'!E11,IF($A$42='00 Pool'!$F$6,'00 Pool'!F11,IF($A$42='00 Pool'!$G$6,'00 Pool'!G11,IF($A$42='00 Pool'!$H$6,'00 Pool'!H11,IF($A$42='00 Pool'!$I$6,'00 Pool'!I11,IF($A$42='00 Pool'!$J$6,'00 Pool'!J11,IF($A$42='00 Pool'!$K$6,'00 Pool'!K11,IF($A$42='00 Pool'!$L$6,'00 Pool'!L11,0))))))))))))","v":"(leer)"}]
[{"$f":"IF($A$42='00 Pool'!$A$6,'00 Pool'!A12,IF($A$42='00 Pool'!$B$6,'00 Pool'!B12,IF($A$42='00 Pool'!$C$6,'00 Pool'!C12,IF($A$42='00 Pool'!$D$6,'00 Pool'!D12,IF($A$42='00 Pool'!$E$6,'00 Pool'!E12,IF($A$42='00 Pool'!$F$6,'00 Pool'!F12,IF($A$42='00 Pool'!$G$6,'00 Pool'!G12,IF($A$42='00 Pool'!$H$6,'00 Pool'!H12,IF($A$42='00 Pool'!$I$6,'00 Pool'!I12,IF($A$42='00 Pool'!$J$6,'00 Pool'!J12,IF($A$42='00 Pool'!$K$6,'00 Pool'!K12,IF($A$42='00 Pool'!$L$6,'00 Pool'!L12,0))))))))))))","v":"(leer)"}]
[{"$f":"IF($A$42='00 Pool'!$A$6,'00 Pool'!A13,IF($A$42='00 Pool'!$B$6,'00 Pool'!B13,IF($A$42='00 Pool'!$C$6,'00 Pool'!C13,IF($A$42='00 Pool'!$D$6,'00 Pool'!D13,IF($A$42='00 Pool'!$E$6,'00 Pool'!E13,IF($A$42='00 Pool'!$F$6,'00 Pool'!F13,IF($A$42='00 Pool'!$G$6,'00 Pool'!G13,IF($A$42='00 Pool'!$H$6,'00 Pool'!H13,IF($A$42='00 Pool'!$I$6,'00 Pool'!I13,IF($A$42='00 Pool'!$J$6,'00 Pool'!J13,IF($A$42='00 Pool'!$K$6,'00 Pool'!K13,IF($A$42='00 Pool'!$L$6,'00 Pool'!L13,0))))))))))))","v":"(leer)"}]
[{"$f":"IF($A$42='00 Pool'!$A$6,'00 Pool'!A14,IF($A$42='00 Pool'!$B$6,'00 Pool'!B14,IF($A$42='00 Pool'!$C$6,'00 Pool'!C14,IF($A$42='00 Pool'!$D$6,'00 Pool'!D14,IF($A$42='00 Pool'!$E$6,'00 Pool'!E14,IF($A$42='00 Pool'!$F$6,'00 Pool'!F14,IF($A$42='00 Pool'!$G$6,'00 Pool'!G14,IF($A$42='00 Pool'!$H$6,'00 Pool'!H14,IF($A$42='00 Pool'!$I$6,'00 Pool'!I14,IF($A$42='00 Pool'!$J$6,'00 Pool'!J14,IF($A$42='00 Pool'!$K$6,'00 Pool'!K14,IF($A$42='00 Pool'!$L$6,'00 Pool'!L14,0))))))))))))","v":"(leer)"}]
[{"$f":"IF($A$42='00 Pool'!$A$6,'00 Pool'!A15,IF($A$42='00 Pool'!$B$6,'00 Pool'!B15,IF($A$42='00 Pool'!$C$6,'00 Pool'!C15,IF($A$42='00 Pool'!$D$6,'00 Pool'!D15,IF($A$42='00 Pool'!$E$6,'00 Pool'!E15,IF($A$42='00 Pool'!$F$6,'00 Pool'!F15,IF($A$42='00 Pool'!$G$6,'00 Pool'!G15,IF($A$42='00 Pool'!$H$6,'00 Pool'!H15,IF($A$42='00 Pool'!$I$6,'00 Pool'!I15,IF($A$42='00 Pool'!$J$6,'00 Pool'!J15,IF($A$42='00 Pool'!$K$6,'00 Pool'!K15,IF($A$42='00 Pool'!$L$6,'00 Pool'!L15,0))))))))))))","v":"(leer)"}]
[{"$f":"IF($A$42='00 Pool'!$A$6,'00 Pool'!A16,IF($A$42='00 Pool'!$B$6,'00 Pool'!B16,IF($A$42='00 Pool'!$C$6,'00 Pool'!C16,IF($A$42='00 Pool'!$D$6,'00 Pool'!D16,IF($A$42='00 Pool'!$E$6,'00 Pool'!E16,IF($A$42='00 Pool'!$F$6,'00 Pool'!F16,IF($A$42='00 Pool'!$G$6,'00 Pool'!G16,IF($A$42='00 Pool'!$H$6,'00 Pool'!H16,IF($A$42='00 Pool'!$I$6,'00 Pool'!I16,IF($A$42='00 Pool'!$J$6,'00 Pool'!J16,IF($A$42='00 Pool'!$K$6,'00 Pool'!K16,IF($A$42='00 Pool'!$L$6,'00 Pool'!L16,0))))))))))))","v":"(leer)"}]
[{"$f":"'01 Instrument'!B17","v":"(leer)"},null,"--","-","a","+","++"]
[{"$f":"IF($A$53='00 Pool'!$A$6,'00 Pool'!A7,IF($A$53='00 Pool'!$B$6,'00 Pool'!B7,IF($A$53='00 Pool'!$C$6,'00 Pool'!C7,IF($A$53='00 Pool'!$D$6,'00 Pool'!D7,IF($A$53='00 Pool'!$E$6,'00 Pool'!E7,IF($A$53='00 Pool'!$F$6,'00 Pool'!F7,IF($A$53='00 Pool'!$G$6,'00 Pool'!G7,IF($A$53='00 Pool'!$H$6,'00 Pool'!H7,IF($A$53='00 Pool'!$I$6,'00 Pool'!I7,IF($A$53='00 Pool'!$J$6,'00 Pool'!J7,IF($A$53='00 Pool'!$K$6,'00 Pool'!K7,IF($A$53='00 Pool'!$L$6,'00 Pool'!L7,0))))))))))))","v":"(leer)"}]
[{"$f":"IF($A$53='00 Pool'!$A$6,'00 Pool'!A8,IF($A$53='00 Pool'!$B$6,'00 Pool'!B8,IF($A$53='00 Pool'!$C$6,'00 Pool'!C8,IF($A$53='00 Pool'!$D$6,'00 Pool'!D8,IF($A$53='00 Pool'!$E$6,'00 Pool'!E8,IF($A$53='00 Pool'!$F$6,'00 Pool'!F8,IF($A$53='00 Pool'!$G$6,'00 Pool'!G8,IF($A$53='00 Pool'!$H$6,'00 Pool'!H8,IF($A$53='00 Pool'!$I$6,'00 Pool'!I8,IF($A$53='00 Pool'!$J$6,'00 Pool'!J8,IF($A$53='00 Pool'!$K$6,'00 Pool'!K8,IF($A$53='00 Pool'!$L$6,'00 Pool'!L8,0))))))))))))","v":"(leer)"}]
[{"$f":"IF($A$53='00 Pool'!$A$6,'00 Pool'!A9,IF($A$53='00 Pool'!$B$6,'00 Pool'!B9,IF($A$53='00 Pool'!$C$6,'00 Pool'!C9,IF($A$53='00 Pool'!$D$6,'00 Pool'!D9,IF($A$53='00 Pool'!$E$6,'00 Pool'!E9,IF($A$53='00 Pool'!$F$6,'00 Pool'!F9,IF($A$53='00 Pool'!$G$6,'00 Pool'!G9,IF($A$53='00 Pool'!$H$6,'00 Pool'!H9,IF($A$53='00 Pool'!$I$6,'00 Pool'!I9,IF($A$53='00 Pool'!$J$6,'00 Pool'!J9,IF($A$53='00 Pool'!$K$6,'00 Pool'!K9,IF($A$53='00 Pool'!$L$6,'00 Pool'!L9,0))))))))))))","v":"(leer)"}]
[{"$f":"IF($A$53='00 Pool'!$A$6,'00 Pool'!A10,IF($A$53='00 Pool'!$B$6,'00 Pool'!B10,IF($A$53='00 Pool'!$C$6,'00 Pool'!C10,IF($A$53='00 Pool'!$D$6,'00 Pool'!D10,IF($A$53='00 Pool'!$E$6,'00 Pool'!E10,IF($A$53='00 Pool'!$F$6,'00 Pool'!F10,IF($A$53='00 Pool'!$G$6,'00 Pool'!G10,IF($A$53='00 Pool'!$H$6,'00 Pool'!H10,IF($A$53='00 Pool'!$I$6,'00 Pool'!I10,IF($A$53='00 Pool'!$J$6,'00 Pool'!J10,IF($A$53='00 Pool'!$K$6,'00 Pool'!K10,IF($A$53='00 Pool'!$L$6,'00 Pool'!L10,0))))))))))))","v":"(leer)"}]
[{"$f":"IF($A$53='00 Pool'!$A$6,'00 Pool'!A11,IF($A$53='00 Pool'!$B$6,'00 Pool'!B11,IF($A$53='00 Pool'!$C$6,'00 Pool'!C11,IF($A$53='00 Pool'!$D$6,'00 Pool'!D11,IF($A$53='00 Pool'!$E$6,'00 Pool'!E11,IF($A$53='00 Pool'!$F$6,'00 Pool'!F11,IF($A$53='00 Pool'!$G$6,'00 Pool'!G11,IF($A$53='00 Pool'!$H$6,'00 Pool'!H11,IF($A$53='00 Pool'!$I$6,'00 Pool'!I11,IF($A$53='00 Pool'!$J$6,'00 Pool'!J11,IF($A$53='00 Pool'!$K$6,'00 Pool'!K11,IF($A$53='00 Pool'!$L$6,'00 Pool'!L11,0))))))))))))","v":"(leer)"}]
[{"$f":"IF($A$53='00 Pool'!$A$6,'00 Pool'!A12,IF($A$53='00 Pool'!$B$6,'00 Pool'!B12,IF($A$53='00 Pool'!$C$6,'00 Pool'!C12,IF($A$53='00 Pool'!$D$6,'00 Pool'!D12,IF($A$53='00 Pool'!$E$6,'00 Pool'!E12,IF($A$53='00 Pool'!$F$6,'00 Pool'!F12,IF($A$53='00 Pool'!$G$6,'00 Pool'!G12,IF($A$53='00 Pool'!$H$6,'00 Pool'!H12,IF($A$53='00 Pool'!$I$6,'00 Pool'!I12,IF($A$53='00 Pool'!$J$6,'00 Pool'!J12,IF($A$53='00 Pool'!$K$6,'00 Pool'!K12,IF($A$53='00 Pool'!$L$6,'00 Pool'!L12,0))))))))))))","v":"(leer)"}]
[{"$f":"IF($A$53='00 Pool'!$A$6,'00 Pool'!A13,IF($A$53='00 Pool'!$B$6,'00 Pool'!B13,IF($A$53='00 Pool'!$C$6,'00 Pool'!C13,IF($A$53='00 Pool'!$D$6,'00 Pool'!D13,IF($A$53='00 Pool'!$E$6,'00 Pool'!E13,IF($A$53='00 Pool'!$F$6,'00 Pool'!F13,IF($A$53='00 Pool'!$G$6,'00 Pool'!G13,IF($A$53='00 Pool'!$H$6,'00 Pool'!H13,IF($A$53='00 Pool'!$I$6,'00 Pool'!I13,IF($A$53='00 Pool'!$J$6,'00 Pool'!J13,IF($A$53='00 Pool'!$K$6,'00 Pool'!K13,IF($A$53='00 Pool'!$L$6,'00 Pool'!L13,0))))))))))))","v":"(leer)"}]
[{"$f":"IF($A$53='00 Pool'!$A$6,'00 Pool'!A14,IF($A$53='00 Pool'!$B$6,'00 Pool'!B14,IF($A$53='00 Pool'!$C$6,'00 Pool'!C14,IF($A$53='00 Pool'!$D$6,'00 Pool'!D14,IF($A$53='00 Pool'!$E$6,'00 Pool'!E14,IF($A$53='00 Pool'!$F$6,'00 Pool'!F14,IF($A$53='00 Pool'!$G$6,'00 Pool'!G14,IF($A$53='00 Pool'!$H$6,'00 Pool'!H14,IF($A$53='00 Pool'!$I$6,'00 Pool'!I14,IF($A$53='00 Pool'!$J$6,'00 Pool'!J14,IF($A$53='00 Pool'!$K$6,'00 Pool'!K14,IF($A$53='00 Pool'!$L$6,'00 Pool'!L14,0))))))))))))","v":"(leer)"}]
[{"$f":"IF($A$53='00 Pool'!$A$6,'00 Pool'!A15,IF($A$53='00 Pool'!$B$6,'00 Pool'!B15,IF($A$53='00 Pool'!$C$6,'00 Pool'!C15,IF($A$53='00 Pool'!$D$6,'00 Pool'!D15,IF($A$53='00 Pool'!$E$6,'00 Pool'!E15,IF($A$53='00 Pool'!$F$6,'00 Pool'!F15,IF($A$53='00 Pool'!$G$6,'00 Pool'!G15,IF($A$53='00 Pool'!$H$6,'00 Pool'!H15,IF($A$53='00 Pool'!$I$6,'00 Pool'!I15,IF($A$53='00 Pool'!$J$6,'00 Pool'!J15,IF($A$53='00 Pool'!$K$6,'00 Pool'!K15,IF($A$53='00 Pool'!$L$6,'00 Pool'!L15,0))))))))))))","v":"(leer)"}]
[{"$f":"IF($A$53='00 Pool'!$A$6,'00 Pool'!A16,IF($A$53='00 Pool'!$B$6,'00 Pool'!B16,IF($A$53='00 Pool'!$C$6,'00 Pool'!C16,IF($A$53='00 Pool'!$D$6,'00 Pool'!D16,IF($A$53='00 Pool'!$E$6,'00 Pool'!E16,IF($A$53='00 Pool'!$F$6,'00 Pool'!F16,IF($A$53='00 Pool'!$G$6,'00 Pool'!G16,IF($A$53='00 Pool'!$H$6,'00 Pool'!H16,IF($A$53='00 Pool'!$I$6,'00 Pool'!I16,IF($A$53='00 Pool'!$J$6,'00 Pool'!J16,IF($A$53='00 Pool'!$K$6,'00 Pool'!K16,IF($A$53='00 Pool'!$L$6,'00 Pool'!L16,0))))))))))))","v":"(leer)"}]
[]
[]
["Kompetenzorientierter Unterricht",null,null,null,null,null,null,null,"Qualitätskriterien"]
[]
["Woran erkenne ich das? (Ergänzungen)"]
[]
[]
[]
[]
[]
[]
[]
[]
[]
[]
[]
[]
[]
["Bemerkungen zur Qualifikation"]
[]
[]
[]
[]
[]
[]
[]
[]
[]
[]
[]
[]
[]
["Ort",null,null,null,null,null,null,"Unterschrift SL"]
["Datum",null,null,null,null,null,null,"Unterschrift LP"]

{"sheet":"03 Auswertung","index":3,"n_rows":20,"n_cols":49,"rows_kept":20,"cut":false,"hidden":false,"merged":[[5,44,6,44],[19,0,19,30],[19,32,19,48],[5,0,6,0],[5,1,5,30],[5,32,6,32],[5,33,5,37],[5,39,5,43]]}
[]
["Kompetenzorientierter Unterricht",null,null,null,null,null,null,null,null,null,null,null,null,null,null,null,null,null,null,null,null,null,null,null,null,null,null,null,null,null,"Qualitätskriterien",null,"Kompetenzorientierter Unterricht",null,null,null,null,null,null,null,null,null,null,null,null,null,null,null,"Qualitätskriterien"]
[]
[{"$f":"'01 Instrument'!B35","v":"Unterrichtsbeurteilung Schulleitung"},null,null,null,null,null,null,null,null,null,null,null,null,null,null,null,null,null,null,null,null,null,null,null,null,null,null,null,null,null,"© DVS Luzern",null,{"$f":"A4","v":"Unterrichtsbeurteilung Schulleitung"},null,null,null,null,null,null,null,null,null,null,null,null,null,null,null,"© DVS Luzern"]
[]
[{"$f":"'01 Instrument'!B32","v":"Authentische Anforderungssituationen"},"Lehrperson (−− = 1 | − = 2 | a= 3 | + = 4 | ++ = 5)",null,null,null,null,null,null,null,null,null,null,null,null,null,null,null,null,null,null,null,null,null,null,null,null,null,null,null,null,null,null,{"$f":"A6","v":"Authentische Anforderungssituationen"},"absolut",null,null,null,null,"total","relativ [%]",null,null,null,null,"MW","positiv [%]"]
[null,1,2,3,4,5,6,7,8,9,10,11,12,13,14,15,16,17,18,19,20,21,22,23,24,25,26,27,28,29,30,null,null,"--","-","a","+","++","n","--","-","a","+","++",null,"(a/+/++)"]
[{"$f":"IF($A$6='00 Pool'!$A$6,'00 Pool'!A7,IF($A$6='00 Pool'!$B$6,'00 Pool'!B7,IF($A$6='00 Pool'!$C$6,'00 Pool'!C7,IF($A$6='00 Pool'!$D$6,'00 Pool'!D7,IF($A$6='00 Pool'!$E$6,'00 Pool'!E7,IF($A$6='00 Pool'!$F$6,'00 Pool'!F7,IF($A$6='00 Pool'!$G$6,'00 Pool'!G7,IF($A$6='00 Pool'!$H$6,'00 Pool'!H7,IF($A$6='00 Pool'!$I$6,'00 Pool'!I7,IF($A$6='00 Pool'!$J$6,'00 Pool'!J7,IF($A$6='00 Pool'!$K$6,'00 Pool'!K7,IF($A$6='00 Pool'!$L$6,'00 Pool'!L7,0))))))))))))","v":"Die LP bindet Aufgaben/Fragen/Problemstellungen in den Unterricht ein, die für die Lernenden bedeutsam sind."},null,null,null,null,null,null,null,null,null,null,null,null,null,null,null,null,null,null,null,null,null,null,null,null,null,null,null,null,null,null,null,{"$f":"A8","v":"Die LP bindet Aufgaben/Fragen/Problemstellungen in den Unterricht ein, die für die Lernenden bedeutsam sind."},{"$f":"COUNTIF(B8:AE8,1)","v":0},{"$f":"COUNTIF(B8:AE8,2)","v":0},{"$f":"COUNTIF(B8:AE8,3)","v":0},{"$f":"COUNTIF(B8:AE8,4)","v":0},{"$f":"COUNTIF(B8:AE8,5)","v":0},{"$f":"SUM(AH8:AL8)","v":0},{"$f":"IF($AM8=0,0,AH8/$AM8*100)","v":0},{"$f":"IF($AM8=0,0,AI8/$AM8*100)","v":0},0,0,0,{"$f":"IF($AM8=0,0,(AH8+AI8*2+AJ8*3+AK8*4+AL8*5)/AM8)","v":0},{"$f":"SUM(AP8:AR8)","v":0}]
[{"$f":"IF($A$6='00 Pool'!$A$6,'00 Pool'!A8,IF($A$6='00 Pool'!$B$6,'00 Pool'!B8,IF($A$6='00 Pool'!$C$6,'00 Pool'!C8,IF($A$6='00 Pool'!$D$6,'00 Pool'!D8,IF($A$6='00 Pool'!$E$6,'00 Pool'!E8,IF($A$6='00 Pool'!$F$6,'00 Pool'!F8,IF($A$6='00 Pool'!$G$6,'00 Pool'!G8,IF($A$6='00 Pool'!$H$6,'00 Pool'!H8,IF($A$6='00 Pool'!$I$6,'00 Pool'!I8,IF($A$6='00 Pool'!$J$6,'00 Pool'!J8,IF($A$6='00 Pool'!$K$6,'00 Pool'!K8,IF($A$6='00 Pool'!$L$6,'00 Pool'!L8,0))))))))))))","v":"Die LP schafft im Unterricht einen Bezug zur aktuellen Lebenswelt der Lernenden."},null,null,null,null,null,null,null,null,null,null,null,null,null,null,null,null,null,null,null,null,null,null,null,null,null,null,null,null,null,null,null,{"$f":"A9","v":"Die LP schafft im Unterricht einen Bezug zur aktuellen Lebenswelt der Lernenden."},{"$f":"COUNTIF(B9:AE9,1)","v":0},{"$f":"COUNTIF(B9:AE9,2)","v":0},{"$f":"COUNTIF(B9:AE9,3)","v":0},{"$f":"COUNTIF(B9:AE9,4)","v":0},{"$f":"COUNTIF(B9:AE9,5)","v":0},0,{"$f":"IF($AM9=0,0,AH9/$AM9*100)","v":0},{"$f":"IF($AM9=0,0,AI9/$AM9*100)","v":0},{"$f":"IF($AM9=0,0,AJ9/$AM9*100)","v":0},{"$f":"IF($AM9=0,0,AK9/$AM9*100)","v":0},{"$f":"IF($AM9=0,0,AL9/$AM9*100)","v":0},{"$f":"IF($AM9=0,0,(AH9+AI9*2+AJ9*3+AK9*4+AL9*5)/AM9)","v":0},{"$f":"SUM(AP9:AR9)","v":0}]
[{"$f":"IF($A$6='00 Pool'!$A$6,'00 Pool'!A9,IF($A$6='00 Pool'!$B$6,'00 Pool'!B9,IF($A$6='00 Pool'!$C$6,'00 Pool'!C9,IF($A$6='00 Pool'!$D$6,'00 Pool'!D9,IF($A$6='00 Pool'!$E$6,'00 Pool'!E9,IF($A$6='00 Pool'!$F$6,'00 Pool'!F9,IF($A$6='00 Pool'!$G$6,'00 Pool'!G9,IF($A$6='00 Pool'!$H$6,'00 Pool'!H9,IF($A$6='00 Pool'!$I$6,'00 Pool'!I9,IF($A$6='00 Pool'!$J$6,'00 Pool'!J9,IF($A$6='00 Pool'!$K$6,'00 Pool'!K9,IF($A$6='00 Pool'!$L$6,'00 Pool'!L9,0))))))))))))","v":"Die LP kann die Lernenden für die Aufgaben/Fragen/Problemstellungen motivieren."},null,null,null,null,null,null,null,null,null,null,null,null,null,null,null,null,null,null,null,null,null,null,null,null,null,null,null,null,null,null,null,"Die LP kann die Lernenden für die Aufgaben/Fragen/Problemstellungen motivieren.",0,0,0,0,0,0,0,0,0,0,0,0,0]
[{"$f":"IF($A$6='00 Pool'!$A$6,'00 Pool'!A10,IF($A$6='00 Pool'!$B$6,'00 Pool'!B10,IF($A$6='00 Pool'!$C$6,'00 Pool'!C10,IF($A$6='00 Pool'!$D$6,'00 Pool'!D10,IF($A$6='00 Pool'!$E$6,'00 Pool'!E10,IF($A$6='00 Pool'!$F$6,'00 Pool'!F10,IF($A$6='00 Pool'!$G$6,'00 Pool'!G10,IF($A$6='00 Pool'!$H$6,'00 Pool'!H10,IF($A$6='00 Pool'!$I$6,'00 Pool'!I10,IF($A$6='00 Pool'!$J$6,'00 Pool'!J10,IF($A$6='00 Pool'!$K$6,'00 Pool'!K10,IF($A$6='00 Pool'!$L$6,'00 Pool'!L10,0))))))))))))","v":"(leer)"},null,null,null,null,null,null,null,null,null,null,null,null,null,null,null,null,null,null,null,null,null,null,null,null,null,null,null,null,null,null,null,"(leer)",0,0,0,0,0,0,0,0,0,0,0,0,0]
[{"$f":"IF($A$6='00 Pool'!$A$6,'00 Pool'!A11,IF($A$6='00 Pool'!$B$6,'00 Pool'!B11,IF($A$6='00 Pool'!$C$6,'00 Pool'!C11,IF($A$6='00 Pool'!$D$6,'00 Pool'!D11,IF($A$6='00 Pool'!$E$6,'00 Pool'!E11,IF($A$6='00 Pool'!$F$6,'00 Pool'!F11,IF($A$6='00 Pool'!$G$6,'00 Pool'!G11,IF($A$6='00 Pool'!$H$6,'00 Pool'!H11,IF($A$6='00 Pool'!$I$6,'00 Pool'!I11,IF($A$6='00 Pool'!$J$6,'00 Pool'!J11,IF($A$6='00 Pool'!$K$6,'00 Pool'!K11,IF($A$6='00 Pool'!$L$6,'00 Pool'!L11,0))))))))))))","v":"(leer)"},null,null,null,null,null,null,null,null,null,null,null,null,null,null,null,null,null,null,null,null,null,null,null,null,null,null,null,null,null,null,null,"(leer)",0,0,0,0,0,0,0,0,0,0,0,0,0]
[{"$f":"IF($A$6='00 Pool'!$A$6,'00 Pool'!A12,IF($A$6='00 Pool'!$B$6,'00 Pool'!B12,IF($A$6='00 Pool'!$C$6,'00 Pool'!C12,IF($A$6='00 Pool'!$D$6,'00 Pool'!D12,IF($A$6='00 Pool'!$E$6,'00 Pool'!E12,IF($A$6='00 Pool'!$F$6,'00 Pool'!F12,IF($A$6='00 Pool'!$G$6,'00 Pool'!G12,IF($A$6='00 Pool'!$H$6,'00 Pool'!H12,IF($A$6='00 Pool'!$I$6,'00 Pool'!I12,IF($A$6='00 Pool'!$J$6,'00 Pool'!J12,IF($A$6='00 Pool'!$K$6,'00 Pool'!K12,IF($A$6='00 Pool'!$L$6,'00 Pool'!L12,0))))))))))))","v":"(leer)"},null,null,null,null,null,null,null,null,null,null,null,null,null,null,null,null,null,null,null,null,null,null,null,null,null,null,null,null,null,null,null,"(leer)",0,0,0,0,0,0,0,0,0,0,0,0,0]
[{"$f":"IF($A$6='00 Pool'!$A$6,'00 Pool'!A13,IF($A$6='00 Pool'!$B$6,'00 Pool'!B13,IF($A$6='00 Pool'!$C$6,'00 Pool'!C13,IF($A$6='00 Pool'!$D$6,'00 Pool'!D13,IF($A$6='00 Pool'!$E$6,'00 Pool'!E13,IF($A$6='00 Pool'!$F$6,'00 Pool'!F13,IF($A$6='00 Pool'!$G$6,'00 Pool'!G13,IF($A$6='00 Pool'!$H$6,'00 Pool'!H13,IF($A$6='00 Pool'!$I$6,'00 Pool'!I13,IF($A$6='00 Pool'!$J$6,'00 Pool'!J13,IF($A$6='00 Pool'!$K$6,'00 Pool'!K13,IF($A$6='00 Pool'!$L$6,'00 Pool'!L13,0))))))))))))","v":"(leer)"},null,null,null,null,null,null,null,null,null,null,null,null,null,null,null,null,null,null,null,null,null,null,null,null,null,null,null,null,null,null,null,"(leer)",0,0,0,0,0,0,0,0,0,0,0,0,0]
[{"$f":"IF($A$6='00 Pool'!$A$6,'00 Pool'!A14,IF($A$6='00 Pool'!$B$6,'00 Pool'!B14,IF($A$6='00 Pool'!$C$6,'00 Pool'!C14,IF($A$6='00 Pool'!$D$6,'00 Pool'!D14,IF($A$6='00 Pool'!$E$6,'00 Pool'!E14,IF($A$6='00 Pool'!$F$6,'00 Pool'!F14,IF($A$6='00 Pool'!$G$6,'00 Pool'!G14,IF($A$6='00 Pool'!$H$6,'00 Pool'!H14,IF($A$6='00 Pool'!$I$6,'00 Pool'!I14,IF($A$6='00 Pool'!$J$6,'00 Pool'!J14,IF($A$6='00 Pool'!$K$6,'00 Pool'!K14,IF($A$6='00 Pool'!$L$6,'00 Pool'!L14,0))))))))))))","v":"(leer)"},null,null,null,null,null,null,null,null,null,null,null,null,null,null,null,null,null,null,null,null,null,null,null,null,null,null,null,null,null,null,null,"(leer)",0,0,0,0,0,0,0,0,0,0,0,0,0]
[{"$f":"IF($A$6='00 Pool'!$A$6,'00 Pool'!A15,IF($A$6='00 Pool'!$B$6,'00 Pool'!B15,IF($A$6='00 Pool'!$C$6,'00 Pool'!C15,IF($A$6='00 Pool'!$D$6,'00 Pool'!D15,IF($A$6='00 Pool'!$E$6,'00 Pool'!E15,IF($A$6='00 Pool'!$F$6,'00 Pool'!F15,IF($A$6='00 Pool'!$G$6,'00 Pool'!G15,IF($A$6='00 Pool'!$H$6,'00 Pool'!H15,IF($A$6='00 Pool'!$I$6,'00 Pool'!I15,IF($A$6='00 Pool'!$J$6,'00 Pool'!J15,IF($A$6='00 Pool'!$K$6,'00 Pool'!K15,IF($A$6='00 Pool'!$L$6,'00 Pool'!L15,0))))))))))))","v":"(leer)"},null,null,null,null,null,null,null,null,null,null,null,null,null,null,null,null,null,null,null,null,null,null,null,null,null,null,null,null,null,null,null,"(leer)",0,0,0,0,0,0,0,0,0,0,0,0,0]
[{"$f":"IF($A$6='00 Pool'!$A$6,'00 Pool'!A16,IF($A$6='00 Pool'!$B$6,'00 Pool'!B16,IF($A$6='00 Pool'!$C$6,'00 Pool'!C16,IF($A$6='00 Pool'!$D$6,'00 Pool'!D16,IF($A$6='00 Pool'!$E$6,'00 Pool'!E16,IF($A$6='00 Pool'!$F$6,'00 Pool'!F16,IF($A$6='00 Pool'!$G$6,'00 Pool'!G16,IF($A$6='00 Pool'!$H$6,'00 Pool'!H16,IF($A$6='00 Pool'!$I$6,'00 Pool'!I16,IF($A$6='00 Pool'!$J$6,'00 Pool'!J16,IF($A$6='00 Pool'!$K$6,'00 Pool'!K16,IF($A$6='00 Pool'!$L$6,'00 Pool'!L16,0))))))))))))","v":"(leer)"},null,null,null,null,null,null,null,null,null,null,null,null,null,null,null,null,null,null,null,null,null,null,null,null,null,null,null,null,null,null,null,"(leer)",0,0,0,0,0,0,0,0,0,0,0,0,0]
[]
["Bemerkungen/Beobachtungen",null,null,null,null,null,null,null,null,null,null,null,null,null,null,null,null,null,null,null,null,null,null,null,null,null,null,null,null,null,null,null,"Bemerkungen/Beobachtungen"]
[null,null,null,null,null,null,null,null,null,null,null,null,null,null,null,null,null,null,null,null,null,null,null,null,null,null,null,null,null,null,null,null,{"$f":"IF(A20=\"\",\"\",A20)","v":""}]